Target
Induced myeloid leukemia cell differentiation protein Mcl-1
Ligand
BDBM50107130
Substrate
Meas. Tech.
ChEMBL_610768 (CHEMBL1064403)
Kd
84000±n/a nM
Citation
 Bernardo, PHSivaraman, TWan, KFXu, JKrishnamoorthy, JSong, CMTian, LChin, JSLim, DSMok, HYYu, VCTong, JCChai, CL Structural insights into the design of small molecule inhibitors that selectively antagonize Mcl-1. J Med Chem 53:2314-8 (2010)  
Target
Name:
Induced myeloid leukemia cell differentiation protein Mcl-1
Synonyms:
BCL2L3 Bcl-2-like protein 3 (Mcl-1) Bcl2-L-3 MCL1 Mcl-1 Myeloid cell leukemia sequence 1 (BCL2-related) | mcl1/EAT
Type:
Membrane; Single-pass membrane protein
Mol. Mass.:
37332.87
Organism:
Homo sapiens (Human)
Description:
Q07820
Residue:
350
  
Inhibitor
Name:
BDBM50107130
Synonyms:
(Z)-2-(5-(4-bromobenzylidene)-4-oxo-2-thioxothiazolidin-3-yl)-3-methylbutanoic acid CHEMBL335265
Type:
Small organic molecule
Emp. Form.:
C15H14BrNO3S2
Mol. Mass.:
400.311
SMILES:
CC(C)C(N1C(=S)S\C(=C/c2ccc(Br)cc2)C1=O)C(O)=O
: