Target
MAP kinase-activated protein kinase 2
Ligand
BDBM50312057
Substrate
Meas. Tech.
ChEMBL_620619 (CHEMBL1114827)
IC50
>2000±n/a nM
Citation
 Berger, DMTorres, NDutia, MPowell, DCiszewski, GGopalsamy, ALevin, JIKim, KHXu, WWilhelm, JHu, YCollins, KFeldberg, LKim, SFrommer, EWojciechowicz, DMallon, R Non-hinge-binding pyrazolo[1,5-a]pyrimidines as potent B-Raf kinase inhibitors. Bioorg Med Chem Lett 19:6519-23 (2009)  
Target
Name:
MAP kinase-activated protein kinase 2
Synonyms:
MAP kinase-activated protein kinase 2 (MAPKAPK2) MAP kinase-activated protein kinase 2 (p38/MK2) MAPK-activated protein kinase 2 MAPKAP kinase 2 MAPKAPK2 | MK2
Type:
Serine/threonine-protein kinase
Mol. Mass.:
45579.87
Organism:
Homo sapiens (Human)
Description:
P49137
Residue:
400
  
Inhibitor
Name:
BDBM50312057
Synonyms:
CHEMBL1087397 N-[3-(3-{4-[(dimethylamino)methyl]phenyl}pyrazolo[1,5-a]pyrimidin-7-yl)phenyl]-3-(trifluoromethyl)benzamide
Type:
Small organic molecule
Emp. Form.:
C29H24F3N5O
Mol. Mass.:
515.529
SMILES:
CN(C)Cc1ccc(cc1)-c1cnn2c(ccnc12)-c1cccc(NC(=O)c2cccc(c2)C(F)(F)F)c1
: