Target
Ribosomal protein S6 kinase beta-1
Ligand
BDBM50312057
Substrate
Meas. Tech.
ChEMBL_620624 (CHEMBL1114832)
IC50
>2000±n/a nM
Citation
 Berger, DMTorres, NDutia, MPowell, DCiszewski, GGopalsamy, ALevin, JIKim, KHXu, WWilhelm, JHu, YCollins, KFeldberg, LKim, SFrommer, EWojciechowicz, DMallon, R Non-hinge-binding pyrazolo[1,5-a]pyrimidines as potent B-Raf kinase inhibitors. Bioorg Med Chem Lett 19:6519-23 (2009)  
Target
Name:
Ribosomal protein S6 kinase beta-1
Synonyms:
70 kDa ribosomal protein S6 kinase 1 70 kDa ribosomal protein kinase (p70S6K) Protein kinase 70S6K (T412E) RPS6KB1 Ribosomal protein S6 kinase I STK14A p70S6K1
Type:
Enzyme
Mol. Mass.:
59139.89
Organism:
Homo sapiens (Human)
Description:
His-tagged S6K1.
Residue:
525
  
Inhibitor
Name:
BDBM50312057
Synonyms:
CHEMBL1087397 N-[3-(3-{4-[(dimethylamino)methyl]phenyl}pyrazolo[1,5-a]pyrimidin-7-yl)phenyl]-3-(trifluoromethyl)benzamide
Type:
Small organic molecule
Emp. Form.:
C29H24F3N5O
Mol. Mass.:
515.529
SMILES:
CN(C)Cc1ccc(cc1)-c1cnn2c(ccnc12)-c1cccc(NC(=O)c2cccc(c2)C(F)(F)F)c1
: