Target
Mitogen-activated protein kinase 14
Ligand
BDBM50314780
Substrate
Meas. Tech.
ChEMBL_627007 (CHEMBL1103663)
Ki
2.3±n/a nM
Citation
 Pettus, LHWurz, RPXu, SHerberich, BHenkle, BLiu, QMcBride, HJMu, SPlant, MHSaris, CJSherman, LWong, LMChmait, SLee, MRMohr, CHsieh, FTasker, AS Discovery and evaluation of 7-alkyl-1,5-bis-aryl-pyrazolopyridinones as highly potent, selective, and orally efficacious inhibitors of p38alpha mitogen-activated protein kinase. J Med Chem 53:2973-85 (2010)  
Target
Name:
Mitogen-activated protein kinase 14
Synonyms:
CSAID-binding protein CSBP1 CSPB1 MAP kinase 14 MAP kinase p38 alpha MAPK14 MK14_HUMAN Mitogen-activated protein kinase p38 alpha Stress-activated protein kinase 2a | p38 MAP kinase alpha/beta
Type:
Serine/threonine-protein kinase
Mol. Mass.:
41286.76
Organism:
Homo sapiens (Human)
Description:
Q16539
Residue:
360
  
Inhibitor
Name:
BDBM50314780
Synonyms:
CHEMBL1091199 N-cyclopropyl-3-[1-(2,4-difluorophenyl)-7-methyl-6-oxo-6,7-dihydro-1H-pyrazolo[3,4-b]pyridin-5-yl]-4-methylbenzamide
Type:
Small organic molecule
Emp. Form.:
C24H20F2N4O2
Mol. Mass.:
434.438
SMILES:
Cc1ccc(cc1-c1cc2cnn(-c3ccc(F)cc3F)c2n(C)c1=O)C(=O)NC1CC1
: