Target
Acetyl-CoA carboxylase 1
Ligand
BDBM50314929
Substrate
Meas. Tech.
ChEMBL_627703 (CHEMBL1115283)
IC50
13±n/a nM
Citation
 Corbett, JWFreeman-Cook, KDElliott, RVajdos, FRajamohan, FKohls, DMarr, EZhang, HTong, LTu, MMurdande, SDoran, SDHouser, JASong, WJones, CJCoffey, SBBuzon, LMinich, MLDirico, KJTapley, SMcPherson, RKSugarman, EHarwood, HJEsler, W Discovery of small molecule isozyme non-specific inhibitors of mammalian acetyl-CoA carboxylase 1 and 2. Bioorg Med Chem Lett 20:2383-8 (2010)  
Target
Name:
Acetyl-CoA carboxylase 1
Synonyms:
ACACA_RAT Acac Acetyl-CoA carboxylase Acetyl-CoA carboxylase 1 (ACC1)
Type:
Protein
Mol. Mass.:
265183.92
Organism:
Rattus norvegicus (Rat)
Description:
P11497
Residue:
2345
  
Inhibitor
Name:
BDBM50314929
Synonyms:
6-(3,5-dimethylisoxazol-4-yl)-1'-(7-methyl-1H-indazole-5-carbonyl)spiro[chroman-2,4'-piperidin]-4-one | CHEMBL1089877
Type:
Small organic molecule
Emp. Form.:
C27H26N4O4
Mol. Mass.:
470.5197
SMILES:
Cc1noc(C)c1-c1ccc2OC3(CCN(CC3)C(=O)c3cc(C)c4[nH]ncc4c3)CC(=O)c2c1
: