Target
Beta-secretase 1
Ligand
BDBM50315010
Substrate
Meas. Tech.
ChEMBL_624424 (CHEMBL1108752)
IC50
410±n/a nM
Citation
 Malamas, MSBarnes, KHui, YJohnson, MLovering, FCondon, JFobare, WSolvibile, WTurner, JHu, YManas, ESFan, KOlland, AChopra, RBard, JPangalos, MNReinhart, PRobichaud, AJ Novel pyrrolyl 2-aminopyridines as potent and selective human beta-secretase (BACE1) inhibitors. Bioorg Med Chem Lett 20:2068-73 (2010)  
Target
Name:
Beta-secretase 1
Synonyms:
ASP2 Aspartyl protease 2 BACE1 Beta-secretase (BACE) Beta-secretase 1 (BACE 1) Beta-secretase 1 (BACE1) Beta-site amyloid precursor protein cleaving enzyme 1 Memapsin-2 beta-Secretase (BACE-1) | beta-Secretase (BACE1)
Type:
Protein
Mol. Mass.:
55755.10
Organism:
Homo sapiens (Human)
Description:
P56817
Residue:
501
  
Inhibitor
Name:
BDBM50315010
Synonyms:
6-((2-(2-chlorophenyl)-5-(4-(pyridazin-3-yloxy)phenyl)-1H-pyrrol-1-yl)methyl)pyridin-2-amine | CHEMBL1092912
Type:
Small organic molecule
Emp. Form.:
C26H20ClN5O
Mol. Mass.:
453.923
SMILES:
Nc1cccc(Cn2c(ccc2-c2ccccc2Cl)-c2ccc(Oc3cccnn3)cc2)n1
: