Target
Beta-2 adrenergic receptor
Ligand
BDBM50318982
Substrate
Meas. Tech.
ChEMBL_635468 (CHEMBL1120618)
Ki
37±n/a nM
Citation
 Tasler, SBaumgartner, RAschenbrenner, AAmmendola, AWolf, KWieber, TSchachtner, JBlisse, MQuotschalla, UNey, P A vHTS approach for the identification of beta-adrenoceptor ligands. Bioorg Med Chem Lett 20:3399-404 (2010)  
Target
Name:
Beta-2 adrenergic receptor
Synonyms:
ADRB2 ADRB2_HUMAN Beta-2 adrenoceptor | Beta-2 adrenoreceptor
Type:
Mol. Mass.:
46461.69
Organism:
Homo sapiens (Human)
Description:
P07550
Residue:
413
  
Inhibitor
Name:
BDBM50318982
Synonyms:
2-((1-(3-(9H-carbazol-4-yloxy)-2-hydroxypropyl)piperidin-4-yl)methyl)-5-hydroxy-1H-benzo[de]isoquinoline-1,3(2H)-dione | CHEMBL1084706
Type:
Small organic molecule
Emp. Form.:
C33H31N3O5
Mol. Mass.:
549.6163
SMILES:
OC(COc1cccc2[nH]c3ccccc3c12)CN1CCC(CN2C(=O)c3cccc4cc(O)cc(C2=O)c34)CC1
: