Target
Kinesin-like protein KIF11
Ligand
BDBM50322584
Substrate
Meas. Tech.
ChEMBL_641759 (CHEMBL1177082)
IC50
870±n/a nM
Citation
 Oishi, SWatanabe, TSawada, JAsai, AOhno, HFujii, N Kinesin spindle protein (KSP) inhibitors with 2,3-fused indole scaffolds. J Med Chem 53:5054-8 (2010)  
Target
Name:
Kinesin-like protein KIF11
Synonyms:
EG5 KIF11_HUMAN Kinesin Spindle Protein Eg5 TRIP5 | kinesin spindle protein
Type:
PROTEIN
Mol. Mass.:
119138.97
Organism:
Homo sapiens (Human)
Description:
ChEMBL_1457426
Residue:
1056
  
Inhibitor
Name:
BDBM50322584
Synonyms:
2-(difluoromethyl)-9H-carbazole | CHEMBL1170284
Type:
Small organic molecule
Emp. Form.:
C13H9F2N
Mol. Mass.:
217.2141
SMILES:
FC(F)c1ccc2c(c1)[nH]c1ccccc21
: