Target
Prostaglandin G/H synthase 2
Ligand
BDBM50326528
Substrate
Meas. Tech.
ChEMBL_658294 (CHEMBL1246851)
IC50
15200±n/a nM
Citation
 Harrak, YCasula, GBasset, JRosell, GPlescia, SRaffa, DCusimano, MGPouplana, RPujol, MD Synthesis, anti-inflammatory activity, and in vitro antitumor effect of a novel class of cyclooxygenase inhibitors: 4-(aryloyl)phenyl methyl sulfones. J Med Chem 53:6560-71 (2010)  
Target
Name:
Prostaglandin G/H synthase 2
Synonyms:
COX2 Cyclooxygenase-2 (COX-2) PTGS2 Prostaglandin G/H synthase (cyclooxygenase)
Type:
Protein
Mol. Mass.:
68976.98
Organism:
Ovis aries (Sheep)
Description:
Residue:
603
  
Inhibitor
Name:
BDBM50326528
Synonyms:
(4-(methylsulfonyl)phenyl)(thiophen-3-yl)methanone | CHEMBL1240889
Type:
Small organic molecule
Emp. Form.:
C12H10O3S2
Mol. Mass.:
266.336
SMILES:
CS(=O)(=O)c1ccc(cc1)C(=O)c1ccsc1
: