Target
Prostaglandin G/H synthase 1
Ligand
BDBM50326524
Substrate
Meas. Tech.
ChEMBL_658293 (CHEMBL1246850)
IC50
177300±n/a nM
Citation
 Harrak, YCasula, GBasset, JRosell, GPlescia, SRaffa, DCusimano, MGPouplana, RPujol, MD Synthesis, anti-inflammatory activity, and in vitro antitumor effect of a novel class of cyclooxygenase inhibitors: 4-(aryloyl)phenyl methyl sulfones. J Med Chem 53:6560-71 (2010)  
Target
Name:
Prostaglandin G/H synthase 1
Synonyms:
COX1 Cyclooxygenase-1 (COX-1) PTGS1 | Prostaglandin G/H synthase (cyclooxygenase)
Type:
Protein
Mol. Mass.:
68868.60
Organism:
Ovis aries (Sheep)
Description:
Residue:
600
  
Inhibitor
Name:
BDBM50326524
Synonyms:
4-(4-(methylsulfonyl)phenyl)-4H-benzo[b]pyrrolo[1,2-d][1,4]oxazine | CHEMBL1243099
Type:
Small organic molecule
Emp. Form.:
C18H15NO3S
Mol. Mass.:
325.382
SMILES:
CS(=O)(=O)c1ccc(cc1)C1Oc2ccccc2-n2cccc12
: