Target
G-protein coupled bile acid receptor 1
Ligand
BDBM50327544
Substrate
Meas. Tech.
ChEMBL_664648 (CHEMBL1260362)
IC50
>10000±n/a nM
Citation
 Herbert, MRSiegel, DLStaszewski, LCayanan, CBanerjee, UDhamija, SAnderson, JFan, AWang, LRix, PShiau, AKRao, TSNoble, SAHeyman, RABischoff, EGuha, MKabakibi, APinkerton, AB Synthesis and SAR of 2-aryl-3-aminomethylquinolines as agonists of the bile acid receptor TGR5. Bioorg Med Chem Lett 20:5718-21 (2010)  
Target
Name:
G-protein coupled bile acid receptor 1
Synonyms:
BG37 GPBAR_HUMAN TGR5 hGPCR19
Type:
G Protein-Coupled Receptor (GPCR)
Mol. Mass.:
35260.02
Organism:
Homo sapiens (Human)
Description:
CHO cells transiently transfected with hTGR5.
Residue:
330
  
Inhibitor
Name:
BDBM50327544
Synonyms:
3-((4-bromophenethylamino)methyl)-2-(thiophen-3-yl)quinoline-6,7-diol | CHEMBL1257855
Type:
Small organic molecule
Emp. Form.:
C22H19BrN2O2S
Mol. Mass.:
455.367
SMILES:
Oc1cc2cc(CNCCc3ccc(Br)cc3)c(nc2cc1O)-c1ccsc1
: