Target
Nitric oxide synthase, brain
Ligand
BDBM29233
Substrate
Meas. Tech.
ChEMBL_685658 (CHEMBL1285560)
Ki
58400±n/a nM
Citation
 Ji, HDelker, SLLi, HMartásek, PRoman, LJPoulos, TLSilverman, RB Exploration of the active site of neuronal nitric oxide synthase by the design and synthesis of pyrrolidinomethyl 2-aminopyridine derivatives. J Med Chem 53:7804-24 (2010)  
Target
Name:
Nitric oxide synthase, brain
Synonyms:
Bnos NC-NOS NOS type I nNOS Neuronal nitric oxide synthase Nitric Oxide Synthase, brain Nitric oxide synthase, brain (nNOS) Nitric-oxide synthase, brain (nNOS) Nos1 | Peptidyl-cysteine S-nitrosylase NOS1
Type:
Enzyme
Mol. Mass.:
160570.98
Organism:
Rattus norvegicus (rat)
Description:
Recombinant nNOS overexpressed in E. coli was used in enzyme assays.
Residue:
1429
  
Inhibitor
Name:
BDBM29233
Synonyms:
CHEMBL508014 | aminopyridine-pyrrolidine, 5
Type:
Small organic molecule
Emp. Form.:
C12H21N5
Mol. Mass.:
235.3286
SMILES:
NCCN[C@@H]1CNC[C@@H]1Cc1cccc(N)n1
: