Target
Cytochrome P450 2C19
Ligand
BDBM50333117
Substrate
Meas. Tech.
ChEMBL_690378 (CHEMBL1634995)
Ki
5100±n/a nM
Citation
 Jeong, SNguyen, PDDesta, Z Comprehensive in vitro analysis of voriconazole inhibition of eight cytochrome P450 (CYP) enzymes: major effect on CYPs 2B6, 2C9, 2C19, and 3A. Antimicrob Agents Chemother 53:541-51 (2009)  
Target
Name:
Cytochrome P450 2C19
Synonyms:
CP2CJ_HUMAN CYPIIC17 Cytochrome P450 2C19 (CYP2C19) Mephenytoin 4-hydroxylase P450-254C
Type:
Enzyme
Mol. Mass.:
55935.47
Organism:
Homo sapiens (Human)
Description:
P33261
Residue:
490
  
Inhibitor
Name:
BDBM50333117
Synonyms:
(2R,3S)-2,3-bis(2,4-difluorophenyl)-1-(1H-1,2,4-triazol-1-yl)butan-2-ol (2R,3S)-2-(2,4-difluorophenyl)-3-(5-fluoropyrimidin-4-yl)-1-(1H-1,2,4-triazol-1-yl)butan-2-ol UK-109496 US9221791, Voriconazole Vfend
Type:
Small organic molecule
Emp. Form.:
C16H14F3N5O
Mol. Mass.:
349.3105
SMILES:
C[C@@H](c1ncncc1F)[C@](O)(Cn1cncn1)c1ccc(F)cc1F
: