Target
Aldo-keto reductase family 1 member C2
Ligand
BDBM50337281
Substrate
Meas. Tech.
ChEMBL_726381 (CHEMBL1687513)
IC50
3400±n/a nM
Citation
 Adeniji, AOTwenter, BMByrns, MCJin, YWinkler, JDPenning, TM Discovery of substituted 3-(phenylamino)benzoic acids as potent and selective inhibitors of type 5 17ß-hydroxysteroid dehydrogenase (AKR1C3). Bioorg Med Chem Lett 21:1464-8 (2011)  
Target
Name:
Aldo-keto reductase family 1 member C2
Synonyms:
3-alpha-HSD3 AK1C2_HUMAN Aldo-keto reductase family 1 member C2 (AK1C2) Aldo-keto reductase family 1 member C2 (AKR1C2) DD-2 DDH2 Dihydrodiol dehydrogenase/bile acid-binding protein Type III 3-alpha-hydroxysteroid dehydrogenase
Type:
Enzyme
Mol. Mass.:
36739.89
Organism:
Homo sapiens (Human)
Description:
Residue:
323
  
Inhibitor
Name:
BDBM50337281
Synonyms:
3-[N-(4-nitrophenyl)amino]benzoic acid US9271961, 5
Type:
Small organic molecule
Emp. Form.:
C13H10N2O4
Mol. Mass.:
258.2295
SMILES:
OC(=O)c1cccc(Nc2ccc(cc2)[N+]([O-])=O)c1
: