Target
Prothrombin
Ligand
BDBM50337492
Substrate
Meas. Tech.
ChEMBL_728395 (CHEMBL1685171)
Ki
37±n/a nM
Citation
 Isaacs, RCNewton, CLCutrona, KJMercer, SPPayne, LSStauffer, KJWilliams, PDCook, JJKrueger, JALewis, SDLucas, BJLyle, EALynch, JJMcMasters, DRNaylor-Olsen, AMMichener, MTWallace, AA Design, synthesis and SAR of a series of 1,3,5-trisubstituted benzenes as thrombin inhibitors. Bioorg Med Chem Lett 21:1536-40 (2011)  
Target
Name:
Prothrombin
Synonyms:
Activation peptide fragment 1 Coagulation factor II Prothrombin precursor Thrombin heavy chain | Thrombin light chain
Type:
Protein
Mol. Mass.:
70029.57
Organism:
Homo sapiens (Human)
Description:
P00734
Residue:
622
  
Inhibitor
Name:
BDBM50337492
Synonyms:
3-(2,2-difluoro-2-(4-methylpyridin-2-yl)ethoxy)-N,N-diisobutyl-5-methylbenzamide | CHEMBL1682768
Type:
Small organic molecule
Emp. Form.:
C24H32F2N2O2
Mol. Mass.:
418.5199
SMILES:
CC(C)CN(CC(C)C)C(=O)c1cc(C)cc(OCC(F)(F)c2cc(C)ccn2)c1
: