Target
11-beta-hydroxysteroid dehydrogenase 1
Ligand
BDBM50340447
Substrate
Meas. Tech.
ChEMBL_741129 (CHEMBL1764400)
IC50
108±n/a nM
Citation
 Venier, OPascal, CBraun, ANamane, CMougenot, PCrespin, OPacquet, FMougenot, CMonseau, COnofri, BDadji-Faïhun, RLeger, CBen-Hassine, MVan-Pham, TRagot, JLPhilippo, CGüssregen, SEngel, CFarjot, GNoah, LManiani, KNicolaï, E Pyrrolidine-pyrazole ureas as potent and selective inhibitors of 11β-hydroxysteroid-dehydrogenase type 1. Bioorg Med Chem Lett 21:2244-51 (2011)  
Target
Name:
11-beta-hydroxysteroid dehydrogenase 1
Synonyms:
11-DH 11-beta-Hydroxysteroid Dehydrogenase 1 (11-beta-HSD1) 11beta-HSD1A Corticosteroid 11-beta-dehydrogenase isozyme 1 (11-beta-HSD-1) Hsd11 | Hsd11b1
Type:
Enzyme
Mol. Mass.:
32369.70
Organism:
Mus musculus (mouse)
Description:
P50172
Residue:
292
  
Inhibitor
Name:
BDBM50340447
Synonyms:
4-((4-(3-(1H-pyrazol-4-yl)pyrrolidine-1-carbonyl)-3,4-dihydroquinoxalin-1(2H)-yl)methyl)-N-cyclopropylbenzamide | CHEMBL1761868
Type:
Small organic molecule
Emp. Form.:
C27H30N6O2
Mol. Mass.:
470.5661
SMILES:
O=C(NC1CC1)c1ccc(CN2CCN(C(=O)N3CCC(C3)c3cn[nH]c3)c3ccccc23)cc1
: