Target
11-beta-hydroxysteroid dehydrogenase 1
Ligand
BDBM50340444
Substrate
Meas. Tech.
ChEMBL_741128 (CHEMBL1764399)
IC50
100±n/a nM
Citation
 Venier, OPascal, CBraun, ANamane, CMougenot, PCrespin, OPacquet, FMougenot, CMonseau, COnofri, BDadji-Faïhun, RLeger, CBen-Hassine, MVan-Pham, TRagot, JLPhilippo, CGüssregen, SEngel, CFarjot, GNoah, LManiani, KNicolaï, E Pyrrolidine-pyrazole ureas as potent and selective inhibitors of 11β-hydroxysteroid-dehydrogenase type 1. Bioorg Med Chem Lett 21:2244-51 (2011)  
Target
Name:
11-beta-hydroxysteroid dehydrogenase 1
Synonyms:
11-DH 11-beta-Hydroxysteroid Dehydrogenase 1 (11-beta-HSD1) 11-beta-hydroxysteroid dehydrogenase 1 (11HSD1) Corticosteroid 11-beta-dehydrogenase isozyme 1 (11-beta-HSD-1) Corticosteroid 11-beta-dehydrogenase isozyme 1 (11beta-HSD1) HSD11 HSD11L | SDR26C1
Type:
Enzyme
Mol. Mass.:
32409.16
Organism:
Homo sapiens (Human)
Description:
P28845
Residue:
292
  
Inhibitor
Name:
BDBM50340444
Synonyms:
4-(4-(3-(1H-pyrazol-4-yl)pyrrolidine-1-carbonyl)-3,4-dihydroquinoxalin-1(2H)-yl)benzamide | CHEMBL1761866
Type:
Small organic molecule
Emp. Form.:
C23H24N6O2
Mol. Mass.:
416.4757
SMILES:
NC(=O)c1ccc(cc1)N1CCN(C(=O)N2CCC(C2)c2cn[nH]c2)c2ccccc12
: