Target
Caspase-1
Ligand
BDBM10355
Substrate
Meas. Tech.
ChEMBL_741339 (CHEMBL1764808)
IC50
8.4±n/a nM
Citation
 Chu, WRothfuss, JZhou, DMach, RH Synthesis and evaluation of isatin analogs as caspase-3 inhibitors: introduction of a hydrophilic group increases potency in a whole cell assay. Bioorg Med Chem Lett 21:2192-7 (2011)  
Target
Name:
Caspase-1
Synonyms:
CASP1 Caspase ICE IL1BCE Interleukin-1 beta-converting enzyme
Type:
Enzyme
Mol. Mass.:
45154.13
Organism:
Homo sapiens (Human)
Description:
P29466
Residue:
404
  
Inhibitor
Name:
BDBM10355
Synonyms:
(3S)-3-[(2S)-2-[(2S)-2-[(2S)-2-acetamido-3-(4-hydroxyphenyl)propanamido]-3-methylbutanamido]propanamido]-4-oxobutanoic acid CHEMBL37630
Type:
Small organic molecule
Emp. Form.:
C23H32N4O8
Mol. Mass.:
492.5222
SMILES:
CC(C)[C@H](NC(=O)[C@H](Cc1ccc(O)cc1)NC(C)=O)C(=O)N[C@@H](C)C(=O)N[C@@H](CC(O)=O)C=O
: