Target
Proto-oncogene tyrosine-protein kinase Src
Ligand
BDBM50342382
Substrate
Meas. Tech.
ChEMBL_743061 (CHEMBL1768532)
IC50
1300±n/a nM
Citation
 Pevet, IBrulé, CTizot, AGohier, ACruzalegui, FBoutin, JAGoldstein, S Synthesis and pharmacological evaluation of thieno[2,3-b]pyridine derivatives as novel c-Src inhibitors. Bioorg Med Chem 19:2517-28 (2011)  
Target
Name:
Proto-oncogene tyrosine-protein kinase Src
Synonyms:
Calmodulin/Proto-oncogene tyrosine-protein kinase Src Proto-oncogene c-Src SRC SRC_HUMAN V-src sarcoma (Schmidt-Ruppin A-2) viral oncogene homolog (avian) p60-Src | pp60c-src
Type:
Protein
Mol. Mass.:
59838.60
Organism:
Homo sapiens (Human)
Description:
P12931
Residue:
536
  
Inhibitor
Name:
BDBM50342382
Synonyms:
3-Amino-thieno[2,3-b]pyridine-2-carboxylic acid(3-methyl-3H-imidazol-4-yl-methylene)hydrazide | CHEMBL1765550
Type:
Small organic molecule
Emp. Form.:
C13H12N6OS
Mol. Mass.:
300.339
SMILES:
Cn1cncc1\C=N\NC(=O)c1sc2ncccc2c1N
: