Target
Histone deacetylase 6
Ligand
BDBM50348397
Substrate
Meas. Tech.
ChEMBL_757638 (CHEMBL1804895)
IC50
13700±n/a nM
Citation
 Kemp, MMWang, QFuller, JHWest, NMartinez, NMMorse, EMWeïwer, MSchreiber, SLBradner, JEKoehler, AN A novel HDAC inhibitor with a hydroxy-pyrimidine scaffold. Bioorg Med Chem Lett 21:4164-9 (2011)  
Target
Name:
Histone deacetylase 6
Synonyms:
Cereblon/Histone deacetylase 6 HDAC6 Histone deacetylase 6 (HDAC6) KIAA0901 | ORF Names:JM21
Type:
Chromatin regulator; hydrolase; repressor
Mol. Mass.:
131381.51
Organism:
Homo sapiens (Human)
Description:
Q9UBN7
Residue:
1215
  
Inhibitor
Name:
BDBM50348397
Synonyms:
CHEMBL1800250
Type:
Small organic molecule
Emp. Form.:
C13H12N2O2S
Mol. Mass.:
260.312
SMILES:
Cc1cc(=O)[nH]c(SCC(=O)c2ccccc2)n1
: