Target
Histone deacetylase 8
Ligand
BDBM50348397
Substrate
Meas. Tech.
ChEMBL_757640 (CHEMBL1804897)
IC50
>100000±n/a nM
Citation
 Kemp, MMWang, QFuller, JHWest, NMartinez, NMMorse, EMWeïwer, MSchreiber, SLBradner, JEKoehler, AN A novel HDAC inhibitor with a hydroxy-pyrimidine scaffold. Bioorg Med Chem Lett 21:4164-9 (2011)  
Target
Name:
Histone deacetylase 8
Synonyms:
HD8 HDAC8_HUMAN Histone deacetylase 8 (HDAC-8) | Human HDAC8
Type:
Enzyme
Mol. Mass.:
41749.60
Organism:
Homo sapiens (Human)
Description:
Q9BY41
Residue:
377
  
Inhibitor
Name:
BDBM50348397
Synonyms:
CHEMBL1800250
Type:
Small organic molecule
Emp. Form.:
C13H12N2O2S
Mol. Mass.:
260.312
SMILES:
Cc1cc(=O)[nH]c(SCC(=O)c2ccccc2)n1
: