Target
Prothrombin
Ligand
BDBM50349350
Substrate
Meas. Tech.
ChEMBL_760106 (CHEMBL1810429)
Ki
1610±n/a nM
Citation
 Sielaff, FBöttcher-Friebertshäuser, EMeyer, DSaupe, SMVolk, IMGarten, WSteinmetzer, T Development of substrate analogue inhibitors for the human airway trypsin-like protease HAT. Bioorg Med Chem Lett 21:4860-4 (2011)  
Target
Name:
Prothrombin
Synonyms:
Activation peptide fragment 1 Coagulation factor II Prothrombin precursor Thrombin heavy chain | Thrombin light chain
Type:
Protein
Mol. Mass.:
70029.57
Organism:
Homo sapiens (Human)
Description:
P00734
Residue:
622
  
Inhibitor
Name:
BDBM50349350
Synonyms:
CHEMBL1809256
Type:
Small organic molecule
Emp. Form.:
C23H33N7O4S
Mol. Mass.:
503.618
SMILES:
[#7]\[#6](-[#7])=[#7]\[#6]-[#6]-[#6]-[#6@@H](-[#7]S(=O)(=O)[#6]-c1ccccc1)-[#6](=O)-[#6@H](-[#6]-[#8])-[#7]-[#6]-c1ccc(cc1)-[#6](-[#7])=[#7]
: