Target
Coagulation factor X
Ligand
BDBM50349333
Substrate
Meas. Tech.
ChEMBL_760107 (CHEMBL1810430)
Ki
129±n/a nM
Citation
 Sielaff, FBöttcher-Friebertshäuser, EMeyer, DSaupe, SMVolk, IMGarten, WSteinmetzer, T Development of substrate analogue inhibitors for the human airway trypsin-like protease HAT. Bioorg Med Chem Lett 21:4860-4 (2011)  
Target
Name:
Coagulation factor X
Synonyms:
Activated coagulation factor X (FXa) Coagulation factor X precursor F10 Factor X heavy chain Factor Xa Stuart-Prower factor
Type:
Enzyme
Mol. Mass.:
54726.60
Organism:
Homo sapiens (Human)
Description:
Residue:
488
  
Inhibitor
Name:
BDBM50349333
Synonyms:
CHEMBL1809238
Type:
Small organic molecule
Emp. Form.:
C33H41N9O5S
Mol. Mass.:
675.801
SMILES:
NC(=N)c1ccc(CNC(=O)[C@@H]2CCCN2C(=O)[C@@H](CCC(=O)N2CCN(CC2)c2ncccn2)NS(=O)(=O)Cc2ccccc2)cc1
: