Target
Furin
Ligand
BDBM50349597
Substrate
Meas. Tech.
ChEMBL_759925 (CHEMBL1810119)
Ki
1110±n/a nM
Citation
 Becker, GLHardes, KSteinmetzer, T New substrate analogue furin inhibitors derived from 4-amidinobenzylamide. Bioorg Med Chem Lett 21:4695-7 (2011)  
Target
Name:
Furin
Synonyms:
FUR FURIN_HUMAN PACE | PCSK3
Type:
Enzyme Catalytic Domain
Mol. Mass.:
86676.01
Organism:
Homo sapiens (Human)
Description:
P09958
Residue:
794
  
Inhibitor
Name:
BDBM50349597
Synonyms:
CHEMBL1808926
Type:
Small organic molecule
Emp. Form.:
C33H50N12O4
Mol. Mass.:
678.8281
SMILES:
[#6]-[#6](-[#6])-[#6@@H](-[#7]-[#6](=O)-[#6@H](-[#6]-[#6]-[#6]\[#7]=[#6](/[#7])-[#7])-[#7]-[#6](=O)-[#6]-c1ccccc1)-[#6](=O)-[#7]-[#6@@H](-[#6]-[#6]-[#6]\[#7]=[#6](/[#7])-[#7])-[#6](=O)-[#7]-[#6]-c1ccc(cc1)-[#6](-[#7])=[#7]
: