Target
Cholinesterase
Ligand
BDBM8961
Substrate
Meas. Tech.
ChEMBL_763956 (CHEMBL1820357)
IC50
50±n/a nM
Citation
 Rizzo, SBisi, ABartolini, MMancini, FBelluti, FGobbi, SAndrisano, VRampa, A Multi-target strategy to address Alzheimer's disease: design, synthesis and biological evaluation of new tacrine-based dimers. Eur J Med Chem 46:4336-43 (2011)  
Target
Name:
Cholinesterase
Synonyms:
Acylcholine acylhydrolase Butyrylcholine esterase (BChE) Butyrylcholinesterase (BuChE) CHLE_HUMAN Cholinesterases Pseudocholinesterase
Type:
Homotetramer
Mol. Mass.:
68422.27
Organism:
Homo sapiens (Human)
Description:
P06276
Residue:
602
  
Inhibitor
Name:
BDBM8961
Synonyms:
1,2,3,4-tetrahydro-9-acridinamine 9-THA CHEMBL1337960 Cognex Tracine cid_1935 | tacrine.HCl
Type:
Small organic molecule
Emp. Form.:
C13H14N2
Mol. Mass.:
198.2637
SMILES:
Nc1c2CCCCc2nc2ccccc12
: