Target
Dihydrofolate reductase
Ligand
BDBM18070
Substrate
Meas. Tech.
ChEMBL_764179 (CHEMBL1821390)
Ki
0.081±n/a nM
Citation
 Li, XHilgers, MCunningham, MChen, ZTrzoss, MZhang, JKohnen, LLam, TCreighton, CG C, KNelson, KKwan, BStidham, MBrown-Driver, VShaw, KJFinn, J Structure-based design of new DHFR-based antibacterial agents: 7-aryl-2,4-diaminoquinazolines. Bioorg Med Chem Lett 21:5171-6 (2011)  
Target
Name:
Dihydrofolate reductase
Synonyms:
DYR_STAAU Dihydrofolate reductase Tetrahydrofolate dehydrogenase | folA
Type:
Enzyme
Mol. Mass.:
18249.71
Organism:
Staphylococcus aureus
Description:
Residue:
159
  
Inhibitor
Name:
BDBM18070
Synonyms:
5-[(2-cyclopropyl-7,8-dimethoxy-2H-chromen-5-yl)methyl]pyrimidine-2,4-diamine Iclaprim
Type:
Small organic molecule
Emp. Form.:
C19H22N4O3
Mol. Mass.:
354.403
SMILES:
COc1cc(Cc2cnc(N)nc2N)c2C=CC(Oc2c1OC)C1CC1
: