Target
Melanocyte-stimulating hormone receptor
Ligand
BDBM50358560
Substrate
Meas. Tech.
ChEMBL_790328 (CHEMBL1925781)
Ki
1.8±n/a nM
Citation
 Barkey, NMTafreshi, NKJosan, JSDe Silva, CRSill, KNHruby, VJGillies, RJMorse, DLVagner, J Development of melanoma-targeted polymer micelles by conjugation of a melanocortin 1 receptor (MC1R) specific ligand. J Med Chem 54:8078-84 (2011)  
Target
Name:
Melanocyte-stimulating hormone receptor
Synonyms:
MC1-R MSH-R MSHR_HUMAN Melanocortin receptor (M1 and M4) Melanocortin receptor 1 (MC1-R) | Melanocortin receptor 1 (MC1R)
Type:
Enzyme
Mol. Mass.:
34717.23
Organism:
Homo sapiens (Human)
Description:
Q01726
Residue:
317
  
Inhibitor
Name:
BDBM50358560
Synonyms:
CHEMBL1923663
Type:
Small organic molecule
Emp. Form.:
C44H54N12O6
Mol. Mass.:
846.9764
SMILES:
CC(=O)N[C@@H](CCc1ccccc1)C(=O)N[C@@H](Cc1cnc[nH]1)C(=O)N[C@H](Cc1ccccc1)C(=O)N[C@@H](CCCN=C(N)N)C(=O)N[C@@H](Cc1c[nH]c2ccccc12)C(N)=O
: