Target
Sphingosine 1-phosphate receptor 1
Ligand
BDBM50361891
Substrate
Meas. Tech.
ChEMBL_799851 (CHEMBL1941557)
EC50
35±n/a nM
Citation
 Pennington, LDCroghan, MDSham, KKPickrell, AJHarrington, PEFrohn, MJLanman, BAReed, ABLee, MRXu, HMcElvain, MXu, YZhang, XFiorino, MHorner, MMorrison, HGArnett, HAFotsch, CTasker, ASWong, MCee, VJ Quinolinone-based agonists of S1P¿?: use of a N-scan SAR strategy to optimize in vitro and in vivo activity. Bioorg Med Chem Lett 22:527-31 (2011)  
Target
Name:
Sphingosine 1-phosphate receptor 1
Synonyms:
CHEDG1 Endothelial differentiation G-protein coupled receptor 1 S1P1 S1PR1_HUMAN Sphingosine 1-phosphate receptor Edg-1
Type:
Enzyme
Mol. Mass.:
42836.02
Organism:
Homo sapiens (Human)
Description:
P21453
Residue:
382
  
Inhibitor
Name:
BDBM50361891
Synonyms:
CHEMBL1938952
Type:
Small organic molecule
Emp. Form.:
C21H16F3N3O3
Mol. Mass.:
415.3652
SMILES:
COc1ccncc1C(=O)NC(=O)Nc1ccc(-c2ccccc2)c(c1)C(F)(F)F
: