Target
Sodium-dependent serotonin transporter
Ligand
BDBM50363814
Substrate
Meas. Tech.
ChEMBL_802188 (CHEMBL1949346)
IC50
18800±n/a nM
Citation
 Jaronczyk, MWolosewicz, KGabrielsen, MNowak, GKufareva, IMazurek, APRavna, AWAbagyan, RBojarski, AJSylte, IChilmonczyk, Z Synthesis, in vitro binding studies and docking of long-chain arylpiperazine nitroquipazine analogues, as potential serotonin transporter inhibitors. Eur J Med Chem 49:200-10 (2012)  
Target
Name:
Sodium-dependent serotonin transporter
Synonyms:
5-HT Transporter 5HT transporter Anandamid membrane transporter, AMT Monoamine transporters; Norepinephrine & serotonin Slc6a4 Sodium-dependent serotonin transporter (SERT) | imipramine receptor
Type:
Multi-pass membrane protein
Mol. Mass.:
70168.43
Organism:
Rattus norvegicus (rat)
Description:
P31652
Residue:
630
  
Inhibitor
Name:
BDBM50363814
Synonyms:
CHEMBL1945685
Type:
Small organic molecule
Emp. Form.:
C28H37N5O3
Mol. Mass.:
491.6251
SMILES:
CC(=O)Nc1ccc2nc(ccc2c1)N1CCN(CCCCN2C(=O)CC3(CCCC3)CC2=O)CC1
: