Target
5-hydroxytryptamine receptor 1A
Ligand
BDBM25872
Substrate
Meas. Tech.
ChEMBL_802189 (CHEMBL1949347)
Ki
275±n/a nM
Citation
 Jaronczyk, MWolosewicz, KGabrielsen, MNowak, GKufareva, IMazurek, APRavna, AWAbagyan, RBojarski, AJSylte, IChilmonczyk, Z Synthesis, in vitro binding studies and docking of long-chain arylpiperazine nitroquipazine analogues, as potential serotonin transporter inhibitors. Eur J Med Chem 49:200-10 (2012)  
Target
Name:
5-hydroxytryptamine receptor 1A
Synonyms:
5-HT-1A 5-hydroxytryptamine receptor 1A (5-HT-1A) ADRB2RL1 Dopamine D2 receptor and serotonin 1a receptor HTR1A | Serotonin receptor 1A
Type:
Mol. Mass.:
46122.49
Organism:
Homo sapiens (Human)
Description:
Residue:
422
  
Inhibitor
Name:
BDBM25872
Synonyms:
2-{3-[2-methyl-4-(quinolin-2-yl)piperazin-1-yl]propyl}-2,3-dihydro-1H-isoindole-1,3-dione | buspirone analogue, 3
Type:
Small organic molecule
Emp. Form.:
C25H26N4O2
Mol. Mass.:
414.4995
SMILES:
CC1CN(CCN1CCCN1C(=O)c2ccccc2C1=O)c1ccc2ccccc2n1
: