Target
Sphingosine 1-phosphate receptor 1
Ligand
BDBM23165
Substrate
Meas. Tech.
ChEMBL_806027 (CHEMBL1960544)
EC50
0.29±n/a nM
Citation
 Nakamura, TAsano, MSekiguchi, YMizuno, YTamaki, KNara, FKawase, YYabe, YNakai, DKamiyama, EUrasaki-Kaneno, YShimozato, TDoi-Komuro, HKagari, TTomisato, WInoue, RNagasaki, MYuita, HOguchi-Oshima, KKaneko, RNishi, T Synthesis and evaluation of CS-2100, a potent, orally active and S1P(3)- sparing S1P(1) agonist. Eur J Med Chem 51:92-8 (2012)  
Target
Name:
Sphingosine 1-phosphate receptor 1
Synonyms:
CD_antigen=CD363 Endothelial differentiation G-protein coupled receptor 1 S1P receptor Edg-1 S1PR1_RAT Sphingosine 1-phosphate receptor Edg-1
Type:
PROTEIN
Mol. Mass.:
42770.88
Organism:
Rattus norvegicus
Description:
ChEMBL_1463793
Residue:
383
  
Inhibitor
Name:
BDBM23165
Synonyms:
CHEMBL366208 [(2S)-2-amino-3-hydroxy-2-[2-(4-octylphenyl)ethyl]propoxy]phosphonic acid
Type:
Small organic molecule
Emp. Form.:
C19H34NO5P
Mol. Mass.:
387.4507
SMILES:
CCCCCCCCc1ccc(CC[C@](N)(CO)COP(O)(O)=O)cc1
: