Target
Sphingosine 1-phosphate receptor 1
Ligand
BDBM50364607
Substrate
Meas. Tech.
ChEMBL_806027 (CHEMBL1960544)
EC50
1.5±n/a nM
Citation
 Nakamura, TAsano, MSekiguchi, YMizuno, YTamaki, KNara, FKawase, YYabe, YNakai, DKamiyama, EUrasaki-Kaneno, YShimozato, TDoi-Komuro, HKagari, TTomisato, WInoue, RNagasaki, MYuita, HOguchi-Oshima, KKaneko, RNishi, T Synthesis and evaluation of CS-2100, a potent, orally active and S1P(3)- sparing S1P(1) agonist. Eur J Med Chem 51:92-8 (2012)  
Target
Name:
Sphingosine 1-phosphate receptor 1
Synonyms:
CD_antigen=CD363 Endothelial differentiation G-protein coupled receptor 1 S1P receptor Edg-1 S1PR1_RAT Sphingosine 1-phosphate receptor Edg-1
Type:
PROTEIN
Mol. Mass.:
42770.88
Organism:
Rattus norvegicus
Description:
ChEMBL_1463793
Residue:
383
  
Inhibitor
Name:
BDBM50364607
Synonyms:
CHEMBL1951304
Type:
Small organic molecule
Emp. Form.:
C25H23N3O4S
Mol. Mass.:
461.533
SMILES:
CCc1cc(CN2CC(C2)C(O)=O)sc1-c1noc(n1)-c1ccc(Oc2ccccc2)cc1
: