Target
Plasmepsin II
Ligand
BDBM50071554
Substrate
Meas. Tech.
ChEBML_154921
Ki
90±n/a nM
Citation
 Carroll, CDPatel, HJohnson, TOGuo, TOrlowski, MHe, ZMCavallaro, CLGuo, JOksman, AGluzman, IYConnelly, JChelsky, DGoldberg, DEDolle, RE Identification of potent inhibitors of Plasmodium falciparum plasmepsin II from an encoded statine combinatorial library. Bioorg Med Chem Lett 8:2315-20 (1999)  
Target
Name:
Plasmepsin II
Synonyms:
Aspartic hemoglobinase II PLM2_PLAFX Plasmepsin 2 Plasmepsin-II
Type:
Enzyme
Mol. Mass.:
51482.09
Organism:
Plasmodium falciparum
Description:
P46925
Residue:
453
  
Inhibitor
Name:
BDBM50071554
Synonyms:
3-Hydroxy-4-[(2S,3S)-3-methyl-2-(2-naphthalen-2-yl-acetylamino)-pentanoylamino]-5-phenyl-pentanoic acid butylamide | CHEMBL309721
Type:
Small organic molecule
Emp. Form.:
C33H43N3O4
Mol. Mass.:
545.7122
SMILES:
CCCCNC(=O)CC(O)C(Cc1ccccc1)NC(=O)[C@@H](NC(=O)Cc1ccc2ccccc2c1)[C@@H](C)CC
: