Target
Delta-type opioid receptor
Ligand
BDBM50039029
Substrate
Meas. Tech.
ChEBML_53430
Ki
1.6±n/a nM
Citation
 Thomas, JBHerault, XMRothman, RBBurgess, JPMascarella, SWXu, HHorel, RBDersch, CMCarroll, FI (+/-)-4-[(N-allyl-cis-3-methyl-4-piperidinyl)phenylamino]-N,N-diethylbenzamide displays selective binding for the delta opioid receptor. Bioorg Med Chem Lett 9:3053-6 (1999)  
Target
Name:
Delta-type opioid receptor
Synonyms:
DOR-1 MSL-2 OPRD_MOUSE Oprd1
Type:
Enzyme Catalytic Domain
Mol. Mass.:
40577.25
Organism:
MOUSE
Description:
P32300
Residue:
372
  
Inhibitor
Name:
BDBM50039029
Synonyms:
(+)-4-((alpha R)-((2S,5R)-4-allyl-2,5-dimethylpiperazin-1-yl)(3-methoxyphenyl)methyl)-N,N-diethylbenzamide 3-[(4-Allyl-2,5-dimethyl-piperazin-1-yl)-(4-diethylcarbamoyl-phenyl)-methyl]-benzoic acid 4-((R)-((2S,5R)-4-allyl-2,5-dimethylpiperazin-1-yl)(3-methoxyphenyl)methyl)-N,N-diethylbenzamide 4-[(4-Allyl-2,5-dimethyl-piperazin-1-yl)-(3-methoxy-phenyl)-methyl]-N,N-diethyl-benzamide (SNC 80) 4-[(R)-((2R,5S)-4-Allyl-2,5-dimethyl-piperazin-1-yl)-(3-methoxy-phenyl)-methyl]-N,N-diethyl-benzamide 4-[(R)-((R)-4-(S)-Allyl-2,5-dimethyl-piperazin-1-yl)-(3-methoxy-phenyl)-methyl]-N,N-diethyl-benzamide 4-[(R)-[(2S,5R)-4-allyl-2,5-dimethylpiperazin-1-yl](3-methoxyphenyl)-methyl]-N,N-diethylbenzamide SNC-80
Type:
Small organic molecule
Emp. Form.:
C28H39N3O2
Mol. Mass.:
449.6282
SMILES:
CCN(CC)C(=O)c1ccc(cc1)[C@@H](N1C[C@@H](C)N(CC=C)C[C@@H]1C)c1cccc(OC)c1
: