Target
Cholecystokinin receptor type A
Ligand
BDBM50451028
Substrate
Meas. Tech.
ChEBML_50044
IC50
75±n/a nM
Citation
 Bernad, NBurgaud, BGHorwell, DCLewthwaite, RAMartinez, JPritchard, MC The design and synthesis of the high efficacy, non-peptide CCK1 receptor agonist PD170292. Bioorg Med Chem Lett 10:1245-8 (2000)  
Target
Name:
Cholecystokinin receptor type A
Synonyms:
CCKAR_RAT Cholecystokinin peripheral Cholecystokinin receptor type A
Type:
Enzyme Catalytic Domain
Mol. Mass.:
49676.37
Organism:
RAT
Description:
Cholecystokinin central 0 RAT::P30551
Residue:
444
  
Inhibitor
Name:
BDBM50451028
Synonyms:
CHEMBL2062146 | PD-149164
Type:
Small organic molecule
Emp. Form.:
C33H38FN3O5
Mol. Mass.:
575.6703
SMILES:
C[C@](Cc1c[nH]c2ccccc12)(NC(=O)OC1C2CC3CC(C2)CC1C3)C(=O)N[C@H](CC(O)=O)Cc1ccc(F)cc1
: