Target
Genome polyprotein
Ligand
BDBM50093020
Substrate
Meas. Tech.
ChEBML_143624
IC50
900±n/a nM
Citation
 Llinàs-Brunet, MBailey, MFazal, GGhiro, EGorys, VGoulet, SHalmos, TMaurice, RPoirier, MPoupart, MARancourt, JThibeault, DWernic, DLamarre, D Highly potent and selective peptide-based inhibitors of the hepatitis C virus serine protease: towards smaller inhibitors. Bioorg Med Chem Lett 10:2267-70 (2001)  
Target
Name:
Genome polyprotein
Synonyms:
Hepatitis C virus NS3 protease/helicase | Hepatitis C virus serine protease, NS3/NS4A
Type:
Protein
Mol. Mass.:
67067.41
Organism:
Hepatitis C virus
Description:
A3EZI9
Residue:
631
  
Inhibitor
Name:
BDBM50093020
Synonyms:
1-{[1-{2-[2-(4-Carboxy-butyrylamino)-2-cyclohexyl-acetylamino]-3-methyl-butyryl}-4-(naphthalen-1-ylmethoxy)-pyrrolidine-2-carbonyl]-amino}-cyclopropanecarboxylic acid | CHEMBL408020
Type:
Small organic molecule
Emp. Form.:
C38H50N4O9
Mol. Mass.:
706.825
SMILES:
CC(C)[C@H](NC(=O)[C@@H](NC(=O)CCCC(O)=O)C1CCCCC1)C(=O)N1C[C@@H](C[C@H]1C(=O)NC1(CC1)C(O)=O)OCc1cccc2ccccc12
: