Target
Dipeptidyl peptidase 2
Ligand
BDBM50118943
Substrate
Meas. Tech.
ChEMBL_54693 (CHEMBL669548)
Ki
24700±n/a nM
Citation
 Senten, KVan der Veken, PBal, GDe Meester, ILambeir, AMScharpé, SBauvois, BHaemers, AAugustyns, K Development of potent and selective dipeptidyl peptidase II inhibitors. Bioorg Med Chem Lett 12:2825-8 (2002)  
Target
Name:
Dipeptidyl peptidase 2
Synonyms:
DAP II DPP2_HUMAN Dipeptidyl aminopeptidase II Dipeptidyl peptidase 2 (DPP2) Dipeptidyl peptidase II (DPP II) Dipeptidyl peptidase II and dipeptidyl peptidase IV (DPP2 and DPP4) carboxytripeptidase dipeptidyl(amino)peptidase II | dipeptidylarylamidase
Type:
Protein
Mol. Mass.:
54339.29
Organism:
Homo sapiens (Human)
Description:
Q9UHL4
Residue:
492
  
Inhibitor
Name:
BDBM50118943
Synonyms:
(2S,3S)-2-amino-3-methyl-1-(pyrrolidin-1-yl)pentan-1-one | CHEMBL503274
Type:
Small organic molecule
Emp. Form.:
C10H20N2O
Mol. Mass.:
184.2786
SMILES:
CC[C@H](C)[C@H](N)C(=O)N1CCCC1
: