Target
Dipeptidyl peptidase 2
Ligand
BDBM50118936
Substrate
Meas. Tech.
ChEBML_53193
IC50
62000±n/a nM
Citation
 Senten, KVan der Veken, PBal, GDe Meester, ILambeir, AMScharpé, SBauvois, BHaemers, AAugustyns, K Development of potent and selective dipeptidyl peptidase II inhibitors. Bioorg Med Chem Lett 12:2825-8 (2002)  
Target
Name:
Dipeptidyl peptidase 2
Synonyms:
DAP II DPP2_HUMAN Dipeptidyl aminopeptidase II Dipeptidyl peptidase 2 (DPP2) Dipeptidyl peptidase II (DPP II) Dipeptidyl peptidase II and dipeptidyl peptidase IV (DPP2 and DPP4) carboxytripeptidase dipeptidyl(amino)peptidase II | dipeptidylarylamidase
Type:
Protein
Mol. Mass.:
54339.29
Organism:
Homo sapiens (Human)
Description:
Q9UHL4
Residue:
492
  
Inhibitor
Name:
BDBM50118936
Synonyms:
2-Amino-3-methyl-1-piperidin-1-yl-pentan-1-one CHEMBL93507
Type:
Small organic molecule
Emp. Form.:
C11H22N2O
Mol. Mass.:
198.3052
SMILES:
CCC(C)C(N)C(=O)N1CCCCC1
: