Target
Sphingosine 1-phosphate receptor 1
Ligand
BDBM50158348
Substrate
Meas. Tech.
ChEMBL_201312 (CHEMBL800919)
EC50
0.9±n/a nM
Citation
 Clemens, JJDavis, MDLynch, KRMacdonald, TL Synthesis of para-alkyl aryl amide analogues of sphingosine-1-phosphate: discovery of potent S1P receptor agonists. Bioorg Med Chem Lett 13:3401-4 (2003)  
Target
Name:
Sphingosine 1-phosphate receptor 1
Synonyms:
CHEDG1 Endothelial differentiation G-protein coupled receptor 1 S1P1 S1PR1_HUMAN Sphingosine 1-phosphate receptor Edg-1
Type:
Enzyme
Mol. Mass.:
42836.02
Organism:
Homo sapiens (Human)
Description:
P21453
Residue:
382
  
Inhibitor
Name:
BDBM50158348
Synonyms:
(2S,3R,4E)-2-amino-3-hydroxyoctadec-4-en-1-yl dihydrogen phosphate CHEMBL225155 US11584726, Example S1P sphingosine-1-phosphate
Type:
Small organic molecule
Emp. Form.:
C18H38NO5P
Mol. Mass.:
379.4718
SMILES:
CCCCCCCCCCCCC\C=C\[C@@H](O)[C@@H](N)COP(O)(O)=O
: