Target
Vasopressin V2 receptor
Ligand
BDBM50146295
Substrate
Meas. Tech.
ChEMBL_214261 (CHEMBL818587)
Ki
9±n/a nM
Citation
 Matthews, JMHoekstra, WJDyatkin, ABHecker, LRHlasta, DJPoulter, BLAndrade-Gordon, Pde Garavilla, LDemarest, KTEricson, EGunnet, JWHageman, WLook, RMoore, JBReynolds, CHMaryanoff, BE Potent nonpeptide vasopressin receptor antagonists based on oxazino- and thiazinobenzodiazepine templates. Bioorg Med Chem Lett 14:2747-52 (2004)  
Target
Name:
Vasopressin V2 receptor
Synonyms:
ADHR AVPR2 DIR Renal-type arginine vasopressin receptor V2R_HUMAN Vasopressin V2 receptor | Vasopressin receptor
Type:
Receptor
Mol. Mass.:
40295.28
Organism:
Homo sapiens (Human)
Description:
P30518
Residue:
371
  
Inhibitor
Name:
BDBM50146295
Synonyms:
Biphenyl-2-carboxylic acid [4-(8-fluoro-3,4,11,11a-tetrahydro-1H,5H-2-thia-4a,10-diaza-dibenzo[a,d]cycloheptene-10-carbonyl)-phenyl]-amide | CHEMBL92470
Type:
Small organic molecule
Emp. Form.:
C32H28FN3O2S
Mol. Mass.:
537.647
SMILES:
Fc1ccc2CN3CCSCC3CN(C(=O)c3ccc(NC(=O)c4ccccc4-c4ccccc4)cc3)c2c1
: