Target
Dihydrofolate reductase
Ligand
BDBM50028641
Substrate
Meas. Tech.
ChEBML_54607
Ki
0.002600±n/a nM
Citation
 DeGraw, JIBrown, VHTagawa, HKisliuk, RLGaumont, YSirotnak, FM Synthesis and antitumor activity of 10-alkyl-10-deazaminopterins. A convenient synthesis of 10-deazaminopterin. J Med Chem 25:1227-30 (1983)  
Target
Name:
Dihydrofolate reductase
Synonyms:
DYR_MOUSE | Dhfr
Type:
Enzyme
Mol. Mass.:
21608.82
Organism:
Mus musculus (Mouse)
Description:
Residue:
187
  
Inhibitor
Name:
BDBM50028641
Synonyms:
2-{4-[2-(2,4-Diamino-pteridin-6-yl)-1,1-dimethyl-ethyl]-benzoylamino}-pentanedioic acid(2.5H2O) | CHEMBL20428
Type:
Small organic molecule
Emp. Form.:
C22H25N7O5
Mol. Mass.:
467.4778
SMILES:
CC(C)(Cc1cnc2nc(N)nc(N)c2n1)c1ccc(cc1)C(=O)NC(CCC(O)=O)C(O)=O
: