Target
Angiotensin-converting enzyme
Ligand
BDBM50020843
Substrate
Meas. Tech.
ChEBML_36003
Ki
1.4±n/a nM
Citation
 Andrews, PRCarson, JMCaselli, ASpark, MJWoods, R Conformational analysis and active site modelling of angiotensin-converting enzyme inhibitors. J Med Chem 28:393-9 (1985)  
Target
Name:
Angiotensin-converting enzyme
Synonyms:
ACE Angiotensin converting enzyme (ACE) Angiotensin-converting enzyme, soluble form CD_antigen=CD143 DCP1 Kininase II
Type:
Enzyme
Mol. Mass.:
149709.01
Organism:
Homo sapiens (Human)
Description:
Residue:
1306
  
Inhibitor
Name:
BDBM50020843
Synonyms:
2-[(2S)-2-carboxypyrrolidin-1-yl]-1-methyl-2-oxoethylamidophosphate
Type:
Small organic molecule
Emp. Form.:
C8H13N2O6P
Mol. Mass.:
264.1735
SMILES:
C[C@@H](NP([O-])([O-])=O)C(=O)N1CCC[C@H]1C(O)=O
: