Target
Transporter
Ligand
BDBM50021912
Substrate
Meas. Tech.
ChEBML_193336
Ki
1.5±n/a nM
Citation
 Maryanoff, BEMcComsey, DFGardocki, JFShank, RPCostanzo, MJNortey, SOSchneider, CRSetler, PE Pyrroloisoquinoline antidepressants. 2. In-depth exploration of structure-activity relationships. J Med Chem 30:1433-54 (1987)  
Target
Name:
Transporter
Synonyms:
Monoamine transporters; Norepininephrine & dopamine | Norepinephrine Monoamine transporters
Type:
PROTEIN
Mol. Mass.:
66787.87
Organism:
Rattus norvegicus
Description:
ChEMBL_1463061
Residue:
597
  
Inhibitor
Name:
BDBM50021912
Synonyms:
6-(3-Trifluoromethyl-phenyl)-1,2,3,5,6,10b-hexahydro-pyrrolo[2,1-a]isoquinoline;HCl | CHEMBL286849
Type:
Small organic molecule
Emp. Form.:
C19H18F3N
Mol. Mass.:
317.3481
SMILES:
FC(F)(F)c1cccc(c1)[C@@H]1CN2CCC[C@@H]2c2ccccc12
: