Target
Sodium-dependent dopamine transporter
Ligand
BDBM50021921
Substrate
Meas. Tech.
ChEBML_193333
Ki
25±n/a nM
Citation
 Maryanoff, BEMcComsey, DFGardocki, JFShank, RPCostanzo, MJNortey, SOSchneider, CRSetler, PE Pyrroloisoquinoline antidepressants. 2. In-depth exploration of structure-activity relationships. J Med Chem 30:1433-54 (1987)  
Target
Name:
Sodium-dependent dopamine transporter
Synonyms:
DA transporter SC6A3_RAT Sodium-dependent dopamine transporter | Sodium-dependent dopamine transporter (DAT)
Type:
Multi-pass membrane protein
Mol. Mass.:
68749.45
Organism:
Rattus norvegicus (rat)
Description:
P23977
Residue:
619
  
Inhibitor
Name:
BDBM50021921
Synonyms:
7-Chloro-6-phenyl-1,2,3,5,6,10b-hexahydro-pyrrolo[2,1-a]isoquinoline;HClO4 | CHEMBL33769
Type:
Small organic molecule
Emp. Form.:
C18H18ClN
Mol. Mass.:
283.795
SMILES:
Clc1cccc2[C@H]3CCCN3C[C@@H](c3ccccc3)c12
: