Target
Transporter
Ligand
BDBM50367559
Substrate
Meas. Tech.
ChEBML_193336
Ki
0.550000±n/a nM
Citation
 Maryanoff, BEMcComsey, DFGardocki, JFShank, RPCostanzo, MJNortey, SOSchneider, CRSetler, PE Pyrroloisoquinoline antidepressants. 2. In-depth exploration of structure-activity relationships. J Med Chem 30:1433-54 (1987)  
Target
Name:
Transporter
Synonyms:
Monoamine transporters; Norepininephrine & dopamine | Norepinephrine Monoamine transporters
Type:
PROTEIN
Mol. Mass.:
66787.87
Organism:
Rattus norvegicus
Description:
ChEMBL_1463061
Residue:
597
  
Inhibitor
Name:
BDBM50367559
Synonyms:
CHEMBL1743798
Type:
Small organic molecule
Emp. Form.:
C18H17F2N
Mol. Mass.:
285.3311
SMILES:
Fc1ccc(cc1)[C@@H]1CN2CCC[C@@H]2c2cc(F)ccc12
: