Target
D(1A) dopamine receptor
Ligand
BDBM50001888
Substrate
Meas. Tech.
ChEBML_58650
Ki
50±n/a nM
Citation
 Charifson, PSWyrick, SDHoffman, AJSimmons, RMBowen, JPMcDougald, DLMailman, RB Synthesis and pharmacological characterization of 1-phenyl-, 4-phenyl-, and 1-benzyl-1,2,3,4-tetrahydroisoquinolines as dopamine receptor ligands. J Med Chem 31:1941-6 (1988)  
Target
Name:
D(1A) dopamine receptor
Synonyms:
DOPAMINE D1 Dopamine D1 high Dopamine receptor Dopamine1-like Drd1a
Type:
Enzyme Catalytic Domain
Mol. Mass.:
49429.75
Organism:
RAT
Description:
P18901
Residue:
446
  
Inhibitor
Name:
BDBM50001888
Synonyms:
(chloropromazine) [3-(2-Chloro-phenothiazin-10-yl)-propyl]-dimethyl-amine 1-(2-Allyl-phenoxy)-3-isopropylamino-propan-2-ol 3-(2-chloro-10H-phenothiazin-10-yl)-N,N-dimethylpropan-1-amine CHLORPROMAZINE CHLORPROMAZINE HYDROCHLORIDE CHLORPROMAZINE TANNATE PROMAPAR THORAZINE [3-(2-Chloro-phenothiazin-10-yl)-propyl]-dimethyl-amine( Chlorpromazine) chloropromazine | med.21724, Compound 15
Type:
Small organic molecule
Emp. Form.:
C17H19ClN2S
Mol. Mass.:
318.864
SMILES:
CN(C)CCCN1c2ccccc2Sc2ccc(Cl)cc12
: