Target
D(2) dopamine receptor
Ligand
BDBM50004813
Substrate
Meas. Tech.
ChEBML_60554
Kd
0.097000±n/a nM
Citation
 Kung, HFKasliwal, RPan, SGKung, MPMach, RHGuo, YZ Dopamine D-2 receptor imaging radiopharmaceuticals: synthesis, radiolabeling, and in vitro binding of (R)-(+)- and (S)-(-)-3-iodo-2-hydroxy-6-methoxy-N- [(1-ethyl-2-pyrrolidinyl)methyl]benzamide. J Med Chem 31:1039-43 (1988)  
Target
Name:
D(2) dopamine receptor
Synonyms:
D(2) dopamine receptor DOPAMINE D2 Long DRD2 Dopamine D2 receptor Dopamine D2 receptor (D2R) Dopamine2-like | d2
Type:
Cell-surface receptors
Mol. Mass.:
50647.10
Organism:
Homo sapiens (Human)
Description:
P14416
Residue:
443
  
Inhibitor
Name:
BDBM50004813
Synonyms:
8-[4-(4-Fluoro-phenyl)-4-oxo-butyl]-3-methyl-1-phenyl-1,3,8-triaza-spiro[4.5]decan-4-one CHEMBL267932
Type:
Small organic molecule
Emp. Form.:
C24H28FN3O2
Mol. Mass.:
409.4964
SMILES:
CN1CN(c2ccccc2)C2(CCN(CCCC(=O)c3ccc(F)cc3)CC2)C1=O
: