Target
Carbonic anhydrase 2
Ligand
BDBM50017727
Substrate
Meas. Tech.
ChEBML_45241
Ki
6.8±n/a nM
Citation
 Baldwin, JJPonticello, GSAnderson, PSChristy, MEMurcko, MARandall, WCSchwam, HSugrue, MFSpringer, JPGautheron, P Thienothiopyran-2-sulfonamides: novel topically active carbonic anhydrase inhibitors for the treatment of glaucoma. J Med Chem 32:2510-3 (1989)  
Target
Name:
Carbonic anhydrase 2
Synonyms:
CA-II CAC Carbonate dehydratase II Carbonic anhydrase 2 (CA-II) Carbonic anhydrase C Carbonic anhydrase II (CA-II) Carbonic anhydrase II (hCA II) | Carbonic anhydrase isoenzyme II (hCA II)
Type:
Enzyme
Mol. Mass.:
29250.71
Organism:
Homo sapiens (Human)
Description:
P00918
Residue:
260
  
Inhibitor
Name:
BDBM50017727
Synonyms:
(R) 4-Hydroxy-7,7-dioxo-4,5,6,7-tetrahydro-7lambda*6*-thieno[2,3-b]thiopyran-2-sulfonic acid amide (S) 4-Hydroxy-7,7-dioxo-4,5,6,7-tetrahydro-7lambda*6*-thieno[2,3-b]thiopyran-2-sulfonic acid amide 4-Hydroxy-7,7-dioxo-4,5,6,7-tetrahydro-7lambda*6*-thieno[2,3-b]thiopyran-2-sulfonic acid amide | CHEMBL314569
Type:
Small organic molecule
Emp. Form.:
C7H9NO5S3
Mol. Mass.:
283.345
SMILES:
NS(=O)(=O)c1cc2C(O)CCS(=O)(=O)c2s1
: