Target
Delta-type opioid receptor
Ligand
BDBM50452590
Substrate
Meas. Tech.
ChEMBL_147196 (CHEMBL756872)
Ki
3.3±n/a nM
Citation
 Bryan, WMCallahan, JFCodd, EELemieux, CMoore, MLSchiller, PWWalker, RFHuffman, WF Cyclic enkephalin analogues containing alpha-amino-beta-mercapto-beta,beta-pentamethylenepropionic acid at positions 2 or 5. J Med Chem 32:302-4 (1989)  
Target
Name:
Delta-type opioid receptor
Synonyms:
Cytochrome P450 3A4 Delta opioid receptor Delta-type opioid receptor (DOR) OPRD_RAT Opioid receptor Opioid receptors; mu & delta Ror-a | Voltage-gated potassium channel
Type:
G Protein-Coupled Receptor (GPCR)
Mol. Mass.:
40465.04
Organism:
Rattus norvegicus (rat)
Description:
Competition binding assays were using CHO-K1 cell membranes expressing the opioid receptor.
Residue:
372
  
Inhibitor
Name:
BDBM50452590
Synonyms:
CHEMBL3084309
Type:
Small organic molecule
Emp. Form.:
C31H39N5O7S2
Mol. Mass.:
657.801
SMILES:
N[C@@H](Cc1ccc(O)cc1)C(=O)N[C@@H]1CSSC2(CCCCC2)[C@H](NC(=O)[C@H](Cc2ccccc2)NC(=O)CNC1=O)C(O)=O
: