Target
Delta-type opioid receptor
Ligand
BDBM50016857
Substrate
Meas. Tech.
ChEMBL_146653 (CHEMBL754937)
IC50
1052±n/a nM
Citation
 Landis, GLui, GShook, JEYamamura, HIBurks, TFHruby, VJ Synthesis of highly mu and delta opioid receptor selective peptides containing a photoaffinity group. J Med Chem 32:638-43 (1989)  
Target
Name:
Delta-type opioid receptor
Synonyms:
Cytochrome P450 3A4 Delta opioid receptor Delta-type opioid receptor (DOR) OPRD_RAT Opioid receptor Opioid receptors; mu & delta Ror-a | Voltage-gated potassium channel
Type:
G Protein-Coupled Receptor (GPCR)
Mol. Mass.:
40465.04
Organism:
Rattus norvegicus (rat)
Description:
Competition binding assays were using CHO-K1 cell membranes expressing the opioid receptor.
Residue:
372
  
Inhibitor
Name:
BDBM50016857
Synonyms:
13-[2-Amino-3-(4-hydroxy-phenyl)-propionylamino]-7-(4-azido-benzyl)-3,3,14,14-tetramethyl-6,9,12-trioxo-1,2-dithia-5,8,11-triaza-cyclotetradecane-4-carboxylic acid | CHEMBL2371214
Type:
Small organic molecule
Emp. Form.:
C30H40N6O7S2
Mol. Mass.:
660.805
SMILES:
CC1(C)SSC(C)(C)[C@H](NC(=O)[C@@H](N)Cc2ccc(O)cc2)C(=O)NCC(=O)N[C@@H](Cc2ccc(N)cc2)C(=O)N[C@H]1C(O)=O
: